{"text_format":"1","workbook":"xlsx","n_sheets":14,"sheets":["Empresas","Formulario 1. Ingresos","Formulario 1.A Pro. de ingresos","Formulario 2. Cál. ingresos","Formulario 3. Gastos","Formulario 3.A Pro. de gastos","Formulario 3B. Detalle Inv","Formulario 4. OEC","Formulario 4A. Proyeciones OEC","Formulario 5. Cálculo GP","Formulario 5A. Costo - Nómina","Formulario 6. Gastos de operaci","Formulario 7. Pagos deuda ","Formulario 8. Fuentes y usos "],"not_rendered":{"charts":0,"images":0,"macros":1,"external_links":2,"defined_names":79,"comments":2,"pivot_tables":0},"unopened":[],"bounds":{"document_bytes":16777216,"sheet_cells":100000,"rows_first":2000,"rows_last":500,"rows_between":2000,"halvings":0,"cell_chars":16384,"cell_head_chars":4096},"cells_cut":0,"cells_raw":0,"read":"whole","date_system":"1900"}

{"sheet":"Empresas","index":0,"n_rows":34,"n_cols":6,"rows_kept":34,"cut":false,"hidden":true,"merged":[]}
["Cod","Nombre EICE","Nombre Completo EICE","Código EICE Homologado","Sector","Sector"]
[40,"TELECAFE","SOCIEDAD CANAL REGIONAL DE TELEVISIÓN TELECAFÉ LTDA.","040","Comunicaciones","COMUNICACIONES"]
[54,"TELECARIBE","CANAL REGIONAL DE TELEVISIÓN DEL  CARIBE - TELECARIBE","054","Comunicaciones","DEFENSA"]
[90,"TEVEANDINA","SOCIEDAD CANAL REGIONAL DE TELEVISIÓN LIMITADA - TEVEANDINA  LTDA ","090","Comunicaciones","DESARROLLO_ECONOMICO"]
[118,"RTVC","RADIO TELEVISIÓN NACIONAL DE COLOMBIA - RTVC",118,"Comunicaciones","EDUCACION"]
[120,"SERVICIOS POSTALES","SERVICIOS POSTALES NACIONALES S.A. ",120,"Comunicaciones","ELECTRICO"]
[32,"CORP. DE LA IND. AERONAUTICA","CORPORACIÓN DE LA INDUSTRIA AERONAUTICA COLOMBIANA S.A.","032","Defensa","HACIENDA"]
[33,"INDUSTRIA MILITAR","INDUSTRIA MILITAR","033","Defensa","INTERIOR"]
[34,"SATENA","SERVICIO AÉREO A TERRITORIOS NACIONALES  - SATENA -","034","Defensa","PROTECCION_SOCIAL"]
[53,"HOTELERA TEQUENDAMA","SOCIEDAD HOTELERA TEQUENDAMA S.A ","053","Defensa","TRANSPORTE"]
[50,"ARTESANIAS DE COLOMBIA S.A.","ARTESANÍAS DE COLOMBIA S.A","050","Desarrollo_Economico"]
[97,"ABASTOS DE CUCUTA","CENTRAL DE ABASTOS DE CÚCUTA S.A. - CENABASTOS S.A.-","097","Desarrollo_Economico"]
[125,"ICFES","INSTITUTO COLOMBIANO PARA LA EVALUACION DE LA EDUCACION  - ICFES",125,"Educacion"]
[10,"E. ENERG. AMAZONAS-LIQUIDACION","EMPRESA DE ENERGÍA DEL AMAZONAS S.A. E.S.P EN LIQUIDACIÓN","010","Electrico"]
[13,"CENTRALES ELECT. DE NARINO S.A","CENTRALES ELÉCTRICAS DE NARIÑO S.A.","013","Electrico"]
{"$rows_left_out":20}
{"sheet":"Formulario 1. Ingresos","index":1,"n_rows":104,"n_cols":15,"rows_kept":104,"cut":false,"hidden":false,"merged":[[6,0,6,4],[7,0,7,4],[96,0,98,3],[96,5,99,5],[96,7,96,8],[15,0,17,4],[15,5,18,5],[15,7,15,8],[92,0,92,5],[93,0,93,5],[16,13,16,14],[96,10,96,14],[15,6,18,6],[96,6,99,6],[97,13,97,14],[96,9,97,9],[15,9,16,9],[15,10,15,14]]}
[null,null,null,null,null,null,null,null,"MINISTERIO DE HACIENDA Y CRÉDITO PÚBLICO "]
[null,null,null,null,null,null,null,null,"DIRECCIÓN  GENERAL DEL PRESUPUESTO PÚBLICO NACIONAL "]
[null,null,null,null,null,null,null,null,"ANTEPROYECTO DE PRESUPUESTO EICE VIGENCIA FISCAL 2023"]
[]
[null,null,null,null,null,null,null,null,"FORMULARIO 1. PROYECTO DE PRESUPUESTO DE INGRESOS Y RECURSOS DE CAPITAL"]
[null,null,null,null,null,null,null,null,"CIFRAS EN PESOS"]
["SECTOR "]
["EMPRESA ",null,null,null,null,null,null,"CÓDIGO EICE",{"$f":"IFERROR(VLOOKUP(F8,Empresas!C2:D34,2,FALSE),\"\")","v":""}]
[]
[]
[]
[]
[]
[]
[]
{"$rows_left_out":90}
{"sheet":"Formulario 1.A Pro. de ingresos","index":2,"n_rows":103,"n_cols":23,"rows_kept":103,"cut":false,"hidden":false,"merged":[[15,14,15,16],[95,14,95,16],[15,9,16,9],[15,10,15,12],[6,0,6,3],[7,0,7,3],[15,5,18,5],[15,7,15,8],[15,0,17,4],[95,9,96,9],[92,0,92,5],[93,0,93,5],[15,6,17,6],[15,18,15,22],[16,18,18,18],[16,19,18,19],[16,20,18,20],[16,21,18,21],[16,22,18,22],[95,18,95,22],[96,18,98,18],[96,19,98,19],[96,20,98,20],[96,21,98,21],[96,22,98,22],[97,7,98,7],[95,0,97,3],[95,5,98,5],[95,7,95,8],[95,6,97,6]]}
[null,null,null,null,null,null,null,null,null,"MINISTERIO DE HACIENDA Y CRÉDITO PÚBLICO "]
[null,null,null,null,null,null,null,null,null,"DIRECCIÓN  GENERAL DEL PRESUPUESTO PÚBLICO NACIONAL "]
[null,null,null,null,null,null,null,null,null,"ANTEPROYECTO DE PRESUPUESTO EICE VIGENCIA FISCAL 2023"]
[]
[null,null,null,null,null,null,null,null,null,"FORMULARIO 1A. PROYECCIÓN DE INGRESOS 2023"]
[null,null,null,null,null,null,null,null,null,"CIFRAS EN PESOS"]
["SECTOR ",null,null,null,null,{"$f":"IF('Formulario 1. Ingresos'!F7=\"\",\"\",'Formulario 1. Ingresos'!F7)","v":""}]
["EMPRESA ",null,null,null,null,{"$f":"IF('Formulario 1. Ingresos'!F8=\"\",\"\",'Formulario 1. Ingresos'!F8)","v":""},null,null,"CÓDIGO EICE",{"$f":"IF('Formulario 1. Ingresos'!I8=\"\",\"\",'Formulario 1. Ingresos'!I8)","v":""}]
[]
[]
[]
[]
[]
[]
[]
{"$rows_left_out":89}
{"sheet":"Formulario 2. Cál. ingresos","index":3,"n_rows":40,"n_cols":22,"rows_kept":40,"cut":false,"hidden":false,"merged":[[15,0,19,4],[17,18,19,18],[17,17,19,17],[6,6,6,9],[7,6,7,9],[16,15,16,16],[17,15,19,15],[17,16,19,16],[16,9,19,9],[16,10,19,10],[16,11,19,11],[16,12,19,12],[16,13,19,13],[16,14,19,14],[15,7,15,10],[15,5,19,5],[39,19,40,19],[37,9,38,9],[37,10,38,10],[39,9,40,9],[39,10,40,10],[37,13,38,13],[39,13,40,13],[37,19,38,19],[33,0,33,5],[37,14,38,14],[39,14,40,14],[37,18,38,18],[39,18,40,18],[15,6,19,6],[16,7,19,7],[16,8,19,8],[15,11,15,14],[15,15,15,21],[16,20,19,20],[16,21,19,21],[16,19,19,19],[16,17,16,18]]}
[null,null,null,null,null,null,null,null,null,null,null,null,null,"MINISTERIO DE HACIENDA Y CRÉDITO PÚBLICO "]
[null,null,null,null,null,null,null,null,null,null,null,null,null,"DIRECCIÓN  GENERAL DEL PRESUPUESTO PÚBLICO NACIONAL "]
[null,null,null,null,null,null,null,null,null,null,null,null,null,"ANTEPROYECTO DE PRESUPUESTO EICE VIGENCIA FISCAL 2023"]
[]
[null,null,null,null,null,null,null,null,null,null,null,null,null,"FORMULARIO 2. CÁLCULO DE INGRESOS POR VENTA DE BIENES Y SERVICIOS 2023"]
[null,null,null,null,null,null,null,null,null,null,null,null,null,"CIFRAS EN PESOS"]
[null,null,null,null,null,"SECTOR ",{"$f":"IF('Formulario 1. Ingresos'!F7=\"\",\"\",'Formulario 1. Ingresos'!F7)","v":""}]
[null,null,null,null,null,"EMPRESA ",{"$f":"IF('Formulario 1. Ingresos'!F8=\"\",\"\",'Formulario 1. Ingresos'!F8)","v":""},null,null,null,null,null,"CÓDIGO EICE",{"$f":"IF('Formulario 1. Ingresos'!I8=\"\",\"\",'Formulario 1. Ingresos'!I8)","v":""}]
[]
[]
[]
[]
[]
[]
[]
{"$rows_left_out":26}
{"sheet":"Formulario 3. Gastos","index":4,"n_rows":131,"n_cols":19,"rows_kept":131,"cut":false,"hidden":false,"merged":[[15,16,16,16],[15,17,16,18],[117,0,117,6],[118,0,118,6],[119,0,119,6],[15,8,15,10],[15,11,16,11],[15,12,15,14],[15,15,16,15],[6,0,6,5],[7,0,7,5],[15,0,17,5],[15,6,18,6],[15,7,16,7],[121,12,121,14],[121,15,122,15],[121,16,122,16],[121,17,122,18],[129,0,129,5],[121,0,123,5],[121,6,124,6],[121,7,122,7],[121,8,121,10],[121,11,122,11]]}
[null,null,null,null,null,null,null,null,null,null,"MINISTERIO DE HACIENDA Y CRÉDITO PÚBLICO "]
[null,null,null,null,null,null,null,null,null,null,"DIRECCIÓN  GENERAL DEL PRESUPUESTO PÚBLICO NACIONAL "]
[null,null,null,null,null,null,null,null,null,null,"ANTEPROYECTO DE PRESUPUESTO EICE VIGENCIA FISCAL 2023"]
[]
[null,null,null,null,null,null,null,null,null,null,"FORMULARIO 3. PROYECTO DE PRESUPUESTO DE GASTOS VIGENCIA 2023"]
[null,null,null,null,null,null,null,null,null,null,"CIFRAS EN PESOS"]
["SECTOR ",null,null,null,null,null,{"$f":"IF('Formulario 1. Ingresos'!F7=\"\",\"\",'Formulario 1. Ingresos'!F7)","v":""}]
["EMPRESA ",null,null,null,null,null,{"$f":"IF('Formulario 1. Ingresos'!F8=\"\",\"\",'Formulario 1. Ingresos'!F8)","v":""},null,null,"CÓDIGO EICE",{"$f":"IF('Formulario 1. Ingresos'!I8=\"\",\"\",'Formulario 1. Ingresos'!I8)","v":""}]
[]
[]
[]
[]
[]
[]
[]
{"$rows_left_out":117}
{"sheet":"Formulario 3.A Pro. de gastos","index":5,"n_rows":131,"n_cols":27,"rows_kept":131,"cut":false,"hidden":false,"merged":[[15,15,16,15],[15,16,16,16],[15,7,16,7],[15,8,15,10],[6,0,6,5],[7,0,7,5],[15,0,17,5],[15,6,18,6],[15,19,15,21],[121,19,121,21],[15,22,15,26],[16,22,18,22],[16,23,18,23],[16,24,18,24],[16,25,18,25],[16,26,18,26],[121,22,121,26],[122,22,124,22],[122,23,124,23],[122,24,124,24],[122,25,124,25],[122,26,124,26],[129,0,129,5],[15,17,16,18],[117,0,117,6],[118,0,118,6],[119,0,119,6],[121,0,123,5],[121,6,124,6],[121,7,122,7],[121,8,121,10],[121,11,122,11],[121,12,121,14],[121,15,122,15],[121,16,122,16],[121,17,122,18],[15,11,16,11],[15,12,15,14]]}
[null,null,null,null,null,null,null,null,null,null,"MINISTERIO DE HACIENDA Y CRÉDITO PÚBLICO "]
[null,null,null,null,null,null,null,null,null,null,"DIRECCIÓN  GENERAL DEL PRESUPUESTO PÚBLICO NACIONAL "]
[null,null,null,null,null,null,null,null,null,null,"ANTEPROYECTO DE PRESUPUESTO EICE VIGENCIA FISCAL 2023"]
[]
[null,null,null,null,null,null,null,null,null,null,"FORMULARIO 3A. PROYECCIÓN DEL PRESUPUESTO DE GASTO PARA LAS VIGENCIAS 2024-2026"]
[null,null,null,null,null,null,null,null,null,null,"MILLONES DE PESOS"]
["SECTOR ",null,null,null,null,null,{"$f":"IF('Formulario 1. Ingresos'!F7=\"\",\"\",'Formulario 1. Ingresos'!F7)","v":""}]
["EMPRESA ",null,null,null,null,null,{"$f":"IF('Formulario 1. Ingresos'!F8=\"\",\"\",'Formulario 1. Ingresos'!F8)","v":""},null,null,"CÓDIGO EICE",{"$f":"IF('Formulario 1. Ingresos'!I8=\"\",\"\",'Formulario 1. Ingresos'!I8)","v":""}]
[]
[]
[]
[]
[]
[]
[]
{"$rows_left_out":117}
{"sheet":"Formulario 3B. Detalle Inv","index":6,"n_rows":369,"n_cols":20,"rows_kept":369,"cut":false,"hidden":false,"merged":[[330,11,331,11],[330,12,330,14],[330,15,331,15],[330,16,331,16],[330,17,330,19],[326,0,326,6],[330,0,332,5],[330,6,333,6],[330,7,331,7],[330,8,330,10],[15,12,15,14],[15,15,16,15],[15,16,16,16],[15,17,15,19],[15,11,16,11],[15,8,15,10],[15,7,16,7],[6,0,6,5],[7,0,7,5],[15,0,17,5],[15,6,18,6]]}
[null,null,null,null,null,null,null,null,null,null,"MINISTERIO DE HACIENDA Y CRÉDITO PÚBLICO "]
[null,null,null,null,null,null,null,null,null,null,"DIRECCIÓN  GENERAL DEL PRESUPUESTO PÚBLICO NACIONAL "]
[null,null,null,null,null,null,null,null,null,null,"ANTEPROYECTO DE PRESUPUESTO EICE VIGENCIA FISCAL 2023"]
[]
[null,null,null,null,null,null,null,null,null,null,"FORMULARIO 3B. DETALLE GASTOS DE INVERSIÓN  2023"]
[null,null,null,null,null,null,null,null,null,null,"CIFRAS EN PESOS"]
["SECTOR ",null,null,null,null,null,{"$f":"G16","v":"OBJETO DE GASTO"}]
["EMPRESA ",null,null,null,null,null,{"$f":"IF('Formulario 1. Ingresos'!F8=\"\",\"\",'Formulario 1. Ingresos'!F8)","v":""},null,null,"CÓDIGO EICE",{"$f":"IF('Formulario 1. Ingresos'!I8=\"\",\"\",'Formulario 1. Ingresos'!I8)","v":""}]
[]
[]
[]
[]
[]
[]
[]
{"$rows_left_out":355}
{"sheet":"Formulario 4. OEC","index":7,"n_rows":56,"n_cols":14,"rows_kept":56,"cut":false,"hidden":false,"merged":[[7,0,7,5],[8,0,8,5],[16,0,18,5],[16,6,19,6],[16,9,18,9],[16,7,18,7],[16,8,18,8],[16,13,18,13],[45,0,45,6],[20,0,20,6],[23,0,23,6],[44,0,44,6],[16,10,16,12],[17,10,18,10],[17,11,18,11],[17,12,18,12],[42,0,42,6]]}
[null,null,null,null,null,null,null,null,"MINISTERIO DE HACIENDA Y CRÉDITO PÚBLICO "]
[null,null,null,null,null,null,null,null,"DIRECCIÓN  GENERAL DEL PRESUPUESTO PÚBLICO NACIONAL "]
[null,null,null,null,null,null,null,null,"ANTEPROYECTO DE PRESUPUESTO EICE VIGENCIA FISCAL 2023"]
[]
[null,null,null,null,null,null,null,null,"FORMULARIO 4. OPERACIONES EFECTIVAS DE CAJA VIGENCIA 2023"]
[null,null,null,null,null,null,null,null,"CIFRAS EN PESOS"]
[]
["SECTOR ",null,null,null,null,null,{"$f":"IF('Formulario 1. Ingresos'!F7=\"\",\"\",'Formulario 1. Ingresos'!F7)","v":""}]
["EMPRESA ",null,null,null,null,null,{"$f":"IF('Formulario 1. Ingresos'!F8=\"\",\"\",'Formulario 1. Ingresos'!F8)","v":""},null,null,"CÓDIGO EICE",{"$f":"IF('Formulario 1. Ingresos'!I8=\"\",\"\",'Formulario 1. Ingresos'!I8)","v":""}]
[]
[]
[]
[]
[]
[]
{"$rows_left_out":42}
{"sheet":"Formulario 4A. Proyeciones OEC","index":8,"n_rows":55,"n_cols":14,"rows_kept":55,"cut":false,"hidden":false,"merged":[[16,11,16,13],[17,11,18,11],[17,12,18,12],[17,13,18,13],[19,0,19,6],[22,0,22,6],[43,0,43,6],[44,0,44,6],[7,0,7,5],[8,0,8,5],[16,0,17,5],[16,6,18,6],[41,0,41,6]]}
[null,null,null,null,null,null,null,null,"MINISTERIO DE HACIENDA Y CRÉDITO PÚBLICO "]
[null,null,null,null,null,null,null,null,"DIRECCIÓN  GENERAL DEL PRESUPUESTO PÚBLICO NACIONAL "]
[null,null,null,null,null,null,null,null,"ANTEPROYECTO DE PRESUPUESTO EICE VIGENCIA FISCAL 2023"]
[]
[null,null,null,null,null,null,null,null,"FORMULARIO 4A. PROYECCIÓN OPERACIONES EFECTIVAS DE CAJA 2023"]
[null,null,null,null,null,null,null,null,"CIFRAS EN PESOS"]
[]
["SECTOR ",null,null,null,null,null,{"$f":"IF('Formulario 1. Ingresos'!F7=\"\",\"\",'Formulario 1. Ingresos'!F7)","v":""}]
["EMPRESA ",null,null,null,null,null,{"$f":"IF('Formulario 1. Ingresos'!F8=\"\",\"\",'Formulario 1. Ingresos'!F8)","v":""},null,null,"CÓDIGO EICE",{"$f":"IF('Formulario 1. Ingresos'!I8=\"\",\"\",'Formulario 1. Ingresos'!I8)","v":""}]
[]
[]
[]
[]
[]
[]
{"$rows_left_out":41}
{"sheet":"Formulario 5. Cálculo GP","index":9,"n_rows":246,"n_cols":48,"rows_kept":246,"cut":false,"hidden":false,"merged":[[7,1,7,5],[8,1,8,5],[16,43,16,46],[16,47,19,47],[17,3,17,15],[17,16,17,21],[17,22,19,22],[17,31,19,31],[17,32,19,32],[17,33,19,33],[16,32,16,42],[17,34,19,34],[17,35,19,35],[17,36,19,36],[17,37,19,37],[17,44,19,44],[16,0,19,0],[16,1,19,1],[16,2,19,2],[16,3,16,22],[16,23,16,31],[17,25,19,25],[18,19,19,19],[18,21,19,21],[17,23,19,23],[17,24,19,24],[18,12,19,12],[18,13,19,13],[18,15,19,15],[18,16,19,16],[18,17,19,17],[17,46,19,46],[18,3,18,4],[18,5,19,5],[18,6,19,6],[18,7,19,7],[18,8,19,8],[18,9,19,9],[18,10,19,10],[18,11,19,11],[17,38,19,38],[17,39,19,39],[17,40,19,40],[17,42,19,42],[17,43,19,43],[17,29,19,29],[18,18,19,18],[232,2,232,6],[233,2,234,5],[17,26,19,26],[17,27,19,27],[17,28,19,28],[233,6,234,6],[233,8,234,8],[233,7,234,7]]}
[null,null,null,null,null,null,null,null,"MINISTERIO DE HACIENDA Y CRÉDITO PÚBLICO "]
[null,null,null,null,null,null,null,null,"DIRECCIÓN  GENERAL DEL PRESUPUESTO PÚBLICO NACIONAL "]
[null,null,null,null,null,null,null,null,"ANTEPROYECTO DE PRESUPUESTO EICE VIGENCIA FISCAL 2023"]
[]
[null,null,null,null,null,null,null,null,"FORMULARIO 5. CÁLCULO GASTOS DE PERSONAL VIGENCIA 2023"]
[null,null,null,null,null,null,null,null,"CIFRAS EN PESOS"]
[]
["SECTOR ",{"$f":"IF('Formulario 1. Ingresos'!F7=\"\",\"\",'Formulario 1. Ingresos'!F7)","v":""}]
["EMPRESA ",{"$f":"IF('Formulario 1. Ingresos'!F8=\"\",\"\",'Formulario 1. Ingresos'!F8)","v":""},null,null,null,null,null,null,null,"CÓDIGO EICE",{"$f":"IF('Formulario 1. Ingresos'!I8=\"\",\"\",'Formulario 1. Ingresos'!I8)","v":""}]
[]
[]
[]
[]
[]
[]
{"$rows_left_out":232}
{"sheet":"Formulario 5A. Costo - Nómina","index":10,"n_rows":55,"n_cols":10,"rows_kept":55,"cut":false,"hidden":false,"merged":[[47,1,47,4],[8,2,8,5],[9,2,9,5],[41,1,41,4],[42,1,42,4],[43,1,43,4],[44,1,44,4],[45,1,45,4],[46,1,46,4],[34,1,34,4],[35,1,35,4],[37,1,37,4],[38,1,38,4],[39,1,39,4],[40,1,40,4],[28,1,28,4],[19,1,19,4],[20,1,20,4],[21,1,21,4],[22,1,22,4],[11,1,11,4],[13,1,13,9],[14,1,14,4],[15,1,15,4],[16,1,16,4],[17,1,17,4],[18,1,18,4],[12,2,12,3],[25,1,25,9],[36,1,36,9],[23,1,23,4],[24,1,24,4],[26,1,26,4],[27,1,27,4],[29,1,29,4],[30,1,30,4],[31,1,31,4],[32,1,32,4],[33,1,33,4],[1,1,1,9],[2,1,2,9],[3,1,3,9],[4,1,5,9],[6,1,6,9]]}
[]
[null,"MINISTERIO DE HACIENDA Y CRÉDITO PÚBLICO "]
[null,"DIRECCIÓN  GENERAL DEL PRESUPUESTO PÚBLICO NACIONAL "]
[null,"ANTEPROYECTO DE PRESUPUESTO EICE VIGENCIA FISCAL 2023"]
[null,"FORMULARIO 5A. COSTO DE LA NÓMINA DE PERSONAL VIGENCIA 2023"]
[]
[null,"CIFRAS EN PESOS"]
[]
[null,"SECTOR ",{"$f":"IF('Formulario 1. Ingresos'!F7=\"\",\"\",'Formulario 1. Ingresos'!F7)","v":""}]
[null,"EMPRESA ",{"$f":"IF('Formulario 1. Ingresos'!F8=\"\",\"\",'Formulario 1. Ingresos'!F8)","v":""},null,null,null,null,null,"CÓDIGO EICE",{"$f":"IF('Formulario 1. Ingresos'!I8=\"\",\"\",'Formulario 1. Ingresos'!I8)","v":""}]
[]
[null,"DENOMINACIÓN DEL CARGO ",null,null,null,"GRADO ","CARGOS \nPROVISTOS","CARGOS \nVACANTES ","TOTAL \nCARGOS DE PLANTA ","ASIGNACIÓN \nBÁSICA MENSUAL "]
[null,null,"(1)",null,null,"(2)","(3)","(4)","(5=3+4)","(6)"]
[null,"EMPLEADOS PÚBLICOS "]
[null,null,null,null,null,null,null,null,{"$f":"+G15+H15","v":0}]
{"$rows_left_out":41}
{"sheet":"Formulario 6. Gastos de operaci","index":11,"n_rows":40,"n_cols":23,"rows_kept":40,"cut":false,"hidden":false,"merged":[[17,17,19,17],[17,18,19,18],[17,19,19,19],[39,20,40,20],[37,10,38,10],[37,11,38,11],[37,14,38,14],[37,15,38,15],[37,19,38,19],[37,20,38,20],[39,10,40,10],[39,11,40,11],[39,14,40,14],[39,15,40,15],[39,19,40,19],[15,16,15,22],[16,8,19,8],[16,9,19,9],[16,10,19,10],[16,11,19,11],[16,12,19,12],[16,13,19,13],[16,14,19,14],[16,15,19,15],[16,16,16,17],[15,12,15,15],[16,18,16,19],[16,20,19,20],[16,21,19,21],[16,22,19,22],[17,16,19,16],[15,0,19,5],[33,0,33,6],[6,7,6,10],[7,7,7,10],[15,6,19,6],[15,7,19,7],[15,8,15,11]]}
[null,null,null,null,null,null,null,null,null,null,null,null,null,null,"MINISTERIO DE HACIENDA Y CRÉDITO PÚBLICO "]
[null,null,null,null,null,null,null,null,null,null,null,null,null,null,"DIRECCIÓN  GENERAL DEL PRESUPUESTO PÚBLICO NACIONAL "]
[null,null,null,null,null,null,null,null,null,null,null,null,null,null,"ANTEPROYECTO DE PRESUPUESTO EICE VIGENCIA FISCAL 2023"]
[]
[null,null,null,null,null,null,null,null,null,null,null,null,null,null,"FORMULARIO 6. CÁLCULO DE LOS GASTOS DE OPERACIÓN COMERCIAL - VIGENCIA 2023"]
[null,null,null,null,null,null,null,null,null,null,null,null,null,null,"CIFRAS EN PESOS"]
[null,null,null,null,null,null,"SECTOR ",{"$f":"IF('Formulario 1. Ingresos'!F7=\"\",\"\",'Formulario 1. Ingresos'!F7)","v":""}]
[null,null,null,null,null,null,"EMPRESA ",{"$f":"IF('Formulario 1. Ingresos'!F8=\"\",\"\",'Formulario 1. Ingresos'!F8)","v":""},null,null,null,null,null,"CÓDIGO EICE",{"$f":"IF('Formulario 1. Ingresos'!I8=\"\",\"\",'Formulario 1. Ingresos'!I8)","v":""}]
[]
[]
[]
[]
[]
[]
[]
{"$rows_left_out":26}
{"sheet":"Formulario 7. Pagos deuda ","index":12,"n_rows":36,"n_cols":13,"rows_kept":36,"cut":false,"hidden":false,"merged":[[14,9,14,12],[14,0,15,0],[14,1,15,1],[14,8,15,8],[6,1,6,4],[7,1,7,4],[14,2,14,3],[14,4,14,7]]}
[null,null,null,null,null,null,null,null,"MINISTERIO DE HACIENDA Y CRÉDITO PÚBLICO "]
[null,null,null,null,null,null,null,null,"DIRECCIÓN  GENERAL DEL PRESUPUESTO PÚBLICO NACIONAL "]
[null,null,null,null,null,null,null,null,"ANTEPROYECTO DE PRESUPUESTO EICE VIGENCIA FISCAL 2023"]
[]
[null,null,null,null,null,null,null,null,"FORMULARIO 7. PAGOS PROGRAMADOS DEL SERVICIO DE LA DEUDA PÚBLICA - VIGENCIA 2023"]
[null,null,null,null,null,null,null,null,"CIFRAS EN PESOS"]
["SECTOR ",{"$f":"IF('Formulario 1. Ingresos'!F7=\"\",\"\",'Formulario 1. Ingresos'!F7)","v":""}]
["EMPRESA ",{"$f":"IF('Formulario 1. Ingresos'!F8=\"\",\"\",'Formulario 1. Ingresos'!F8)","v":""},null,null,null,null,null,"CÓDIGO EICE",{"$f":"IF('Formulario 1. Ingresos'!I8=\"\",\"\",'Formulario 1. Ingresos'!I8)","v":""}]
[]
[]
[]
[]
[]
[]
["CLASE DE PRESTAMISTA ","IDENTIFICACIÓN CÓDIGO DEL EMPRESTITO ","SALDO EMPRESTITO MONEDA ORIGINAL ",null,"PAGOS PRÓXIMA VIGENCIA, (T+1) \n(MONEDA ORIGINAL)",null,null,null,"TASA DE CAMBIO ","PAGOS PRÓXIMA VIGENCIA (T+1) (PESOS COLOMBIANOS)"]
{"$rows_left_out":22}
{"sheet":"Formulario 8. Fuentes y usos ","index":13,"n_rows":62,"n_cols":26,"rows_kept":62,"cut":false,"hidden":false,"merged":[[53,6,53,14],[53,16,53,18],[15,6,15,14],[15,16,15,18],[49,0,49,5],[50,0,50,5],[6,0,6,4],[7,0,7,4],[15,0,16,4],[15,5,17,5],[53,0,54,4],[53,5,55,5]]}
[null,null,null,null,null,null,null,null,null,"MINISTERIO DE HACIENDA Y CRÉDITO PÚBLICO "]
[null,null,null,null,null,null,null,null,null,"DIRECCIÓN  GENERAL DEL PRESUPUESTO PÚBLICO NACIONAL "]
[null,null,null,null,null,null,null,null,null,"ANTEPROYECTO DE PRESUPUESTO EICE VIGENCIA FISCAL 2023"]
[]
[null,null,null,null,null,null,null,null,null,"FORMULARIO 8. FUENTES Y USOS DEL PRESUPUESTO"]
[null,null,null,null,null,null,null,null,null,"CIFRAS EN PESOS"]
["SECTOR "]
["EMPRESA ",null,null,null,null,null,null,null,"CÓDIGO EICE",{"$f":"IFERROR(VLOOKUP(F8,Empresas!C2:D34,2,FALSE),\"\")","v":""}]
[]
[]
[]
[]
[]
[]
[]
{"$rows_left_out":47}