{"text_format":"1","workbook":"xlsx","n_sheets":12,"sheets":["Empresas","Formulario 1. Ingresos","Formulario 1.A Pro. de ingresos","Formulario 2. Cál. ingresos","Formulario 3. Gastos","Formulario 3.A Pro. de gastos","Formulario 3B. Detalle Inv","Formulario 4. OEC","Formulario 4A. Proyeciones OEC","Formulario 6. Gastos de operaci","Formulario 7. Pagos deuda ","Formulario 8. Fuentes y usos "],"not_rendered":{"charts":0,"images":0,"macros":1,"external_links":2,"defined_names":66,"comments":0,"pivot_tables":0},"unopened":[],"bounds":{"document_bytes":16777216,"sheet_cells":100000,"rows_first":2000,"rows_last":500,"rows_between":2000,"halvings":0,"cell_chars":16384,"cell_head_chars":4096},"cells_cut":0,"cells_raw":0,"read":"whole","date_system":"1900"}

{"sheet":"Empresas","index":0,"n_rows":34,"n_cols":6,"rows_kept":34,"cut":false,"hidden":true,"merged":[]}
["Cod","Nombre EICE","Nombre Completo EICE","Código EICE Homologado","Sector","Sector"]
[40,"TELECAFE","SOCIEDAD CANAL REGIONAL DE TELEVISIÓN TELECAFÉ LTDA.","040","Comunicaciones","COMUNICACIONES"]
[54,"TELECARIBE","CANAL REGIONAL DE TELEVISIÓN DEL  CARIBE - TELECARIBE","054","Comunicaciones","DEFENSA"]
[90,"TEVEANDINA","SOCIEDAD CANAL REGIONAL DE TELEVISIÓN LIMITADA - TEVEANDINA  LTDA ","090","Comunicaciones","DESARROLLO_ECONOMICO"]
[118,"RTVC","RADIO TELEVISIÓN NACIONAL DE COLOMBIA - RTVC",118,"Comunicaciones","EDUCACION"]
[120,"SERVICIOS POSTALES","SERVICIOS POSTALES NACIONALES S.A. ",120,"Comunicaciones","ELECTRICO"]
[32,"CORP. DE LA IND. AERONAUTICA","CORPORACIÓN DE LA INDUSTRIA AERONAUTICA COLOMBIANA S.A.","032","Defensa","HACIENDA"]
[33,"INDUSTRIA MILITAR","INDUSTRIA MILITAR","033","Defensa","INTERIOR"]
[34,"SATENA","SERVICIO AÉREO A TERRITORIOS NACIONALES  - SATENA -","034","Defensa","PROTECCION_SOCIAL"]
[53,"HOTELERA TEQUENDAMA","SOCIEDAD HOTELERA TEQUENDAMA S.A ","053","Defensa","TRANSPORTE"]
[50,"ARTESANIAS DE COLOMBIA S.A.","ARTESANÍAS DE COLOMBIA S.A","050","Desarrollo_Economico"]
[97,"ABASTOS DE CUCUTA","CENTRAL DE ABASTOS DE CÚCUTA S.A. - CENABASTOS S.A.-","097","Desarrollo_Economico"]
[125,"ICFES","INSTITUTO COLOMBIANO PARA LA EVALUACION DE LA EDUCACION  - ICFES",125,"Educacion"]
[10,"E. ENERG. AMAZONAS-LIQUIDACION","EMPRESA DE ENERGÍA DEL AMAZONAS S.A. E.S.P EN LIQUIDACIÓN","010","Electrico"]
[13,"CENTRALES ELECT. DE NARINO S.A","CENTRALES ELÉCTRICAS DE NARIÑO S.A.","013","Electrico"]
{"$rows_left_out":20}
{"sheet":"Formulario 1. Ingresos","index":1,"n_rows":95,"n_cols":14,"rows_kept":95,"cut":false,"hidden":false,"merged":[[15,9,15,13],[16,12,16,13],[15,5,16,5],[83,0,83,4],[15,0,17,3],[15,4,18,4],[15,6,15,7],[87,9,87,13],[88,12,88,13],[87,0,89,3],[87,4,90,4],[87,5,88,5],[6,0,6,3],[7,0,7,3],[84,0,84,4],[87,6,87,7],[87,8,88,8],[15,8,16,8]]}
[null,null,null,null,null,null,null,null,"MINISTERIO DE HACIENDA Y CRÉDITO PÚBLICO "]
[null,null,null,null,null,null,null,null,"DIRECCIÓN  GENERAL DEL PRESUPUESTO PÚBLICO NACIONAL "]
[null,null,null,null,null,null,null,null,"ANTEPROYECTO DE PRESUPUESTO EICE VIGENCIA FISCAL 2020"]
[]
[null,null,null,null,null,null,null,null,"FORMULARIO 1. PROYECTO DE PRESUPUESTO DE INGRESOS Y RECURSOS DE CAPITAL 2020"]
[null,null,null,null,null,null,null,null,"CIFRAS EN PESOS"]
["SECTOR "]
["EMPRESA ",null,null,null,null,null,null,"CÓDIGO EICE",{"$f":"IFERROR(VLOOKUP(E8,Empresas!C2:D34,2,FALSE),\"\")","v":""}]
[]
[]
[]
[]
[]
[]
[]
{"$rows_left_out":81}
{"sheet":"Formulario 1.A Pro. de ingresos","index":2,"n_rows":95,"n_cols":22,"rows_kept":95,"cut":false,"hidden":false,"merged":[[87,6,87,7],[87,8,88,8],[6,0,6,3],[7,0,7,3],[15,0,17,3],[15,4,18,4],[15,5,16,5],[15,6,15,7],[83,0,83,4],[84,0,84,4],[87,0,89,3],[87,4,90,4],[87,9,87,11],[15,13,15,15],[87,13,87,15],[15,8,16,8],[15,9,15,11],[15,17,15,21],[16,17,18,17],[16,18,18,18],[16,19,18,19],[16,20,18,20],[16,21,18,21],[87,17,87,21],[88,17,90,17],[88,18,90,18],[88,19,90,19],[88,20,90,20],[88,21,90,21]]}
[null,null,null,null,null,null,null,null,"MINISTERIO DE HACIENDA Y CRÉDITO PÚBLICO "]
[null,null,null,null,null,null,null,null,"DIRECCIÓN  GENERAL DEL PRESUPUESTO PÚBLICO NACIONAL "]
[null,null,null,null,null,null,null,null,"ANTEPROYECTO DE PRESUPUESTO EICE VIGENCIA FISCAL 2020"]
[]
[null,null,null,null,null,null,null,null,"FORMULARIO 1A. PROYECCIÓN DE INGRESOS  AÑOS 2021-2023"]
[null,null,null,null,null,null,null,null,"CIFRAS EN PESOS"]
["SECTOR ",null,null,null,{"$f":"IF('Formulario 1. Ingresos'!E7=\"\",\"\",'Formulario 1. Ingresos'!E7)","v":""}]
["EMPRESA ",null,null,null,{"$f":"IF('Formulario 1. Ingresos'!E8=\"\",\"\",'Formulario 1. Ingresos'!E8)","v":""},null,null,"CÓDIGO EICE",{"$f":"IF('Formulario 1. Ingresos'!I8=\"\",\"\",'Formulario 1. Ingresos'!I8)","v":""}]
[]
[]
[]
[]
[]
[]
[]
{"$rows_left_out":81}
{"sheet":"Formulario 2. Cál. ingresos","index":3,"n_rows":45,"n_cols":21,"rows_kept":45,"cut":false,"hidden":false,"merged":[[17,17,19,17],[17,16,19,16],[6,5,6,8],[7,5,7,8],[16,14,16,15],[17,14,19,14],[17,15,19,15],[16,8,19,8],[16,9,19,9],[16,10,19,10],[16,11,19,11],[16,12,19,12],[16,13,19,13],[15,6,15,9],[44,18,45,18],[42,8,43,8],[42,9,43,9],[44,8,45,8],[44,9,45,9],[42,12,43,12],[44,12,45,12],[42,18,43,18],[38,0,38,4],[15,0,19,3],[42,13,43,13],[44,13,45,13],[42,17,43,17],[44,17,45,17],[15,4,19,4],[15,5,19,5],[16,6,19,6],[16,7,19,7],[15,10,15,13],[15,14,15,20],[16,19,19,19],[16,20,19,20],[16,18,19,18],[16,16,16,17]]}
[null,null,null,null,null,null,null,null,null,null,null,null,"MINISTERIO DE HACIENDA Y CRÉDITO PÚBLICO "]
[null,null,null,null,null,null,null,null,null,null,null,null,"DIRECCIÓN  GENERAL DEL PRESUPUESTO PÚBLICO NACIONAL "]
[null,null,null,null,null,null,null,null,null,null,null,null,"ANTEPROYECTO DE PRESUPUESTO EICE VIGENCIA FISCAL 2020"]
[]
[null,null,null,null,null,null,null,null,null,null,null,null,"FORMULARIO 2. CÁLCULO DE INGRESOS POR VENTA DE BIENES Y SERVICIOS"]
[null,null,null,null,null,null,null,null,null,null,null,null,"CIFRAS EN PESOS"]
[null,null,null,null,"SECTOR ",{"$f":"IF('Formulario 1. Ingresos'!E7=\"\",\"\",'Formulario 1. Ingresos'!E7)","v":""}]
[null,null,null,null,"EMPRESA ",{"$f":"IF('Formulario 1. Ingresos'!E8=\"\",\"\",'Formulario 1. Ingresos'!E8)","v":""},null,null,null,null,null,"CÓDIGO EICE",{"$f":"IF('Formulario 1. Ingresos'!I8=\"\",\"\",'Formulario 1. Ingresos'!I8)","v":""}]
[]
[]
[]
[]
[]
[]
[]
{"$rows_left_out":31}
{"sheet":"Formulario 3. Gastos","index":4,"n_rows":131,"n_cols":19,"rows_kept":131,"cut":false,"hidden":false,"merged":[[129,0,129,5],[6,0,6,5],[7,0,7,5],[15,11,16,11],[15,15,16,15],[15,16,16,16],[15,17,16,18],[15,0,17,5],[15,12,15,14],[15,8,15,10],[15,6,18,6],[15,7,16,7],[121,17,122,18],[115,0,115,6],[116,0,116,6],[117,0,117,6],[121,0,123,5],[121,6,124,6],[121,7,122,7],[121,8,121,10],[121,11,122,11],[121,12,121,14],[121,15,122,15],[121,16,122,16]]}
[null,null,null,null,null,null,null,null,null,null,"MINISTERIO DE HACIENDA Y CRÉDITO PÚBLICO "]
[null,null,null,null,null,null,null,null,null,null,"DIRECCIÓN  GENERAL DEL PRESUPUESTO PÚBLICO NACIONAL "]
[null,null,null,null,null,null,null,null,null,null,"ANTEPROYECTO DE PRESUPUESTO EICE VIGENCIA FISCAL 2020"]
[]
[null,null,null,null,null,null,null,null,null,null,"FORMULARIO 3. PROYECTO DE PRESUPUESTO DE GASTOS VIGENCIA 2020"]
[null,null,null,null,null,null,null,null,null,null,"CIFRAS EN PESOS"]
["SECTOR ",null,null,null,null,null,{"$f":"IF('Formulario 1. Ingresos'!E7=\"\",\"\",'Formulario 1. Ingresos'!E7)","v":""}]
["EMPRESA ",null,null,null,null,null,{"$f":"IF('Formulario 1. Ingresos'!E8=\"\",\"\",'Formulario 1. Ingresos'!E8)","v":""},null,null,"CÓDIGO EICE",{"$f":"IF('Formulario 1. Ingresos'!I8=\"\",\"\",'Formulario 1. Ingresos'!I8)","v":""}]
[]
[]
[]
[]
[]
[]
[]
{"$rows_left_out":117}
{"sheet":"Formulario 3.A Pro. de gastos","index":5,"n_rows":131,"n_cols":25,"rows_kept":131,"cut":false,"hidden":false,"merged":[[129,0,129,5],[15,7,16,7],[15,8,15,10],[115,0,115,6],[6,0,6,5],[7,0,7,5],[15,0,17,5],[15,6,18,6],[121,8,121,10],[116,0,116,6],[117,0,117,6],[121,0,123,5],[121,6,124,6],[121,7,122,7],[15,11,16,11],[15,12,15,14],[15,15,16,15],[15,16,16,16],[121,11,122,11],[121,12,121,14],[121,15,122,15],[121,16,122,16],[15,17,15,19],[121,17,121,19],[15,20,15,24],[16,20,18,20],[16,21,18,21],[16,22,18,22],[16,23,18,23],[16,24,18,24],[121,20,121,24],[122,20,124,20],[122,21,124,21],[122,22,124,22],[122,23,124,23],[122,24,124,24]]}
[null,null,null,null,null,null,null,null,null,null,"MINISTERIO DE HACIENDA Y CRÉDITO PÚBLICO "]
[null,null,null,null,null,null,null,null,null,null,"DIRECCIÓN  GENERAL DEL PRESUPUESTO PÚBLICO NACIONAL "]
[null,null,null,null,null,null,null,null,null,null,"ANTEPROYECTO DE PRESUPUESTO EICE VIGENCIA FISCAL 2020"]
[]
[null,null,null,null,null,null,null,null,null,null,"FORMULARIO 3A. PROYECCIÓN DEL PRESUPUESTO DE GASTO PARA LAS VIGENCIAS 2021-2023"]
[null,null,null,null,null,null,null,null,null,null,"CIFRAS EN PESOS"]
["SECTOR ",null,null,null,null,null,{"$f":"IF('Formulario 1. Ingresos'!E7=\"\",\"\",'Formulario 1. Ingresos'!E7)","v":""}]
["EMPRESA ",null,null,null,null,null,{"$f":"IF('Formulario 1. Ingresos'!E8=\"\",\"\",'Formulario 1. Ingresos'!E8)","v":""},null,null,"CÓDIGO EICE",{"$f":"IF('Formulario 1. Ingresos'!I8=\"\",\"\",'Formulario 1. Ingresos'!I8)","v":""}]
[]
[]
[]
[]
[]
[]
[]
{"$rows_left_out":117}
{"sheet":"Formulario 3B. Detalle Inv","index":6,"n_rows":139,"n_cols":20,"rows_kept":139,"cut":false,"hidden":false,"merged":[[124,15,125,15],[124,16,125,16],[124,17,124,19],[15,12,15,14],[15,15,16,15],[15,16,16,16],[15,17,15,19],[124,12,124,14],[15,11,16,11],[15,7,16,7],[124,7,125,7],[6,0,6,5],[7,0,7,5],[15,0,17,5],[15,6,18,6],[15,8,15,10],[120,0,120,6],[124,0,126,5],[124,6,127,6],[124,8,124,10],[124,11,125,11]]}
[null,null,null,null,null,null,null,null,null,null,"MINISTERIO DE HACIENDA Y CRÉDITO PÚBLICO "]
[null,null,null,null,null,null,null,null,null,null,"DIRECCIÓN  GENERAL DEL PRESUPUESTO PÚBLICO NACIONAL "]
[null,null,null,null,null,null,null,null,null,null,"ANTEPROYECTO DE PRESUPUESTO EICE VIGENCIA FISCAL 2020"]
[]
[null,null,null,null,null,null,null,null,null,null,"FORMULARIO 3B. DETALLE GASTOS DE INVERSIÓN "]
[null,null,null,null,null,null,null,null,null,null,"CIFRAS EN PESOS"]
["SECTOR ",null,null,null,null,null,{"$f":"IF('Formulario 1. Ingresos'!E7=\"\",\"\",'Formulario 1. Ingresos'!E7)","v":""}]
["EMPRESA ",null,null,null,null,null,{"$f":"IF('Formulario 1. Ingresos'!E8=\"\",\"\",'Formulario 1. Ingresos'!E8)","v":""},null,null,"CÓDIGO EICE",{"$f":"IF('Formulario 1. Ingresos'!I8=\"\",\"\",'Formulario 1. Ingresos'!I8)","v":""}]
[]
[]
[]
[]
[]
[]
[]
{"$rows_left_out":125}
{"sheet":"Formulario 4. OEC","index":7,"n_rows":57,"n_cols":14,"rows_kept":57,"cut":false,"hidden":false,"merged":[[7,0,7,5],[8,0,8,5],[16,0,18,5],[16,6,19,6],[16,9,18,9],[16,7,18,7],[16,8,18,8],[16,13,18,13],[46,0,46,6],[20,0,20,6],[23,0,23,6],[45,0,45,6],[16,10,16,12],[17,10,18,10],[17,11,18,11],[17,12,18,12],[43,0,43,6]]}
[null,null,null,null,null,null,null,null,"MINISTERIO DE HACIENDA Y CRÉDITO PÚBLICO "]
[null,null,null,null,null,null,null,null,"DIRECCIÓN  GENERAL DEL PRESUPUESTO PÚBLICO NACIONAL "]
[null,null,null,null,null,null,null,null,"ANTEPROYECTO DE PRESUPUESTO EICE VIGENCIA FISCAL 2020"]
[]
[null,null,null,null,null,null,null,null,"FORMULARIO 4. OPERACIONES EFECTIVAS DE CAJA VIGENCIA 2020"]
[null,null,null,null,null,null,null,null,"CIFRAS EN PESOS"]
[]
["SECTOR ",null,null,null,null,null,{"$f":"IF('Formulario 1. Ingresos'!E7=\"\",\"\",'Formulario 1. Ingresos'!E7)","v":""}]
["EMPRESA ",null,null,null,null,null,{"$f":"IF('Formulario 1. Ingresos'!E8=\"\",\"\",'Formulario 1. Ingresos'!E8)","v":""},null,null,"CÓDIGO EICE",{"$f":"IF('Formulario 1. Ingresos'!I8=\"\",\"\",'Formulario 1. Ingresos'!I8)","v":""}]
[]
[]
[]
[]
[]
[]
{"$rows_left_out":43}
{"sheet":"Formulario 4A. Proyeciones OEC","index":8,"n_rows":61,"n_cols":14,"rows_kept":61,"cut":false,"hidden":false,"merged":[[16,11,16,13],[17,11,18,11],[17,12,18,12],[17,13,18,13],[19,0,19,6],[27,0,27,6],[49,0,49,6],[50,0,50,6],[7,0,7,5],[8,0,8,5],[16,0,17,5],[16,6,18,6],[47,0,47,6]]}
[null,null,null,null,null,null,null,null,"MINISTERIO DE HACIENDA Y CRÉDITO PÚBLICO "]
[null,null,null,null,null,null,null,null,"DIRECCIÓN  GENERAL DEL PRESUPUESTO PÚBLICO NACIONAL "]
[null,null,null,null,null,null,null,null,"ANTEPROYECTO DE PRESUPUESTO EICE VIGENCIA FISCAL 2020"]
[]
[null,null,null,null,null,null,null,null,"FORMULARIO 4A. PROYECCIÓN OPERACIONES EFECTIVAS DE CAJA"]
[null,null,null,null,null,null,null,null,"CIFRAS EN PESOS"]
[]
["SECTOR ",null,null,null,null,null,{"$f":"IF('Formulario 1. Ingresos'!E7=\"\",\"\",'Formulario 1. Ingresos'!E7)","v":""}]
["EMPRESA ",null,null,null,null,null,{"$f":"IF('Formulario 1. Ingresos'!E8=\"\",\"\",'Formulario 1. Ingresos'!E8)","v":""},null,null,"CÓDIGO EICE",{"$f":"IF('Formulario 1. Ingresos'!I8=\"\",\"\",'Formulario 1. Ingresos'!I8)","v":""}]
[]
[]
[]
[]
[]
[]
{"$rows_left_out":47}
{"sheet":"Formulario 6. Gastos de operaci","index":9,"n_rows":45,"n_cols":23,"rows_kept":45,"cut":false,"hidden":false,"merged":[[17,17,19,17],[17,18,19,18],[17,19,19,19],[44,20,45,20],[42,10,43,10],[42,11,43,11],[42,14,43,14],[42,15,43,15],[42,19,43,19],[42,20,43,20],[44,10,45,10],[44,11,45,11],[44,14,45,14],[44,15,45,15],[44,19,45,19],[15,16,15,22],[16,8,19,8],[16,9,19,9],[16,10,19,10],[16,11,19,11],[16,12,19,12],[16,13,19,13],[16,14,19,14],[16,15,19,15],[16,16,16,17],[15,12,15,15],[16,18,16,19],[16,20,19,20],[16,21,19,21],[16,22,19,22],[17,16,19,16],[15,0,19,5],[38,0,38,6],[6,7,6,10],[7,7,7,10],[15,6,19,6],[15,7,19,7],[15,8,15,11]]}
[null,null,null,null,null,null,null,null,null,null,null,null,null,null,"MINISTERIO DE HACIENDA Y CRÉDITO PÚBLICO "]
[null,null,null,null,null,null,null,null,null,null,null,null,null,null,"DIRECCIÓN  GENERAL DEL PRESUPUESTO PÚBLICO NACIONAL "]
[null,null,null,null,null,null,null,null,null,null,null,null,null,null,"ANTEPROYECTO DE PRESUPUESTO EICE VIGENCIA FISCAL 2020"]
[]
[null,null,null,null,null,null,null,null,null,null,null,null,null,null,"FORMULARIO 6. CÁLCULO DE LOS GASTOS DE OPERACIÓN COMERCIAL - VIGENCIA 2020"]
[null,null,null,null,null,null,null,null,null,null,null,null,null,null,"CIFRAS EN PESOS"]
[null,null,null,null,null,null,"SECTOR ",{"$f":"IF('Formulario 1. Ingresos'!E7=\"\",\"\",'Formulario 1. Ingresos'!E7)","v":""}]
[null,null,null,null,null,null,"EMPRESA ",{"$f":"IF('Formulario 1. Ingresos'!E8=\"\",\"\",'Formulario 1. Ingresos'!E8)","v":""},null,null,null,null,null,"CÓDIGO EICE",{"$f":"IF('Formulario 1. Ingresos'!I8=\"\",\"\",'Formulario 1. Ingresos'!I8)","v":""}]
[]
[]
[]
[]
[]
[]
[]
{"$rows_left_out":31}
{"sheet":"Formulario 7. Pagos deuda ","index":10,"n_rows":36,"n_cols":15,"rows_kept":36,"cut":false,"hidden":false,"merged":[[14,10,14,14],[14,0,15,0],[14,1,15,1],[14,9,15,9],[6,1,6,4],[7,1,7,4],[14,2,14,3],[14,4,14,8]]}
[null,null,null,null,null,null,null,null,null,"MINISTERIO DE HACIENDA Y CRÉDITO PÚBLICO "]
[null,null,null,null,null,null,null,null,null,"DIRECCIÓN  GENERAL DEL PRESUPUESTO PÚBLICO NACIONAL "]
[null,null,null,null,null,null,null,null,null,"ANTEPROYECTO DE PRESUPUESTO EICE VIGENCIA FISCAL 2020"]
[]
[null,null,null,null,null,null,null,null,null,"FORMULARIO 7. PAGOS PROGRAMADOS DEL SERVICIO DE LA DEUDA PÚBLICA - VIGENCIA 2020"]
[null,null,null,null,null,null,null,null,null,"CIFRAS EN PESOS"]
["SECTOR ",{"$f":"IF('Formulario 1. Ingresos'!E7=\"\",\"\",'Formulario 1. Ingresos'!E7)","v":""}]
["EMPRESA ",{"$f":"IF('Formulario 1. Ingresos'!E8=\"\",\"\",'Formulario 1. Ingresos'!E8)","v":""},null,null,null,null,null,null,"CÓDIGO EICE",{"$f":"IF('Formulario 1. Ingresos'!I8=\"\",\"\",'Formulario 1. Ingresos'!I8)","v":""}]
[]
[]
[]
[]
[]
[]
["CLASE DE PRESTAMISTA ","IDENTIFICACIÓN CÓDIGO DEL EMPRESTITO ","SALDO EMPRESTITO MONEDA ORIGINAL ",null,"PAGOS PRÓXIMA VIGENCIA, (T+1) \n(MONEDA ORIGINAL)",null,null,null,null,"TASA DE CAMBIO ","PAGOS PRÓXIMA VIGENCIA (T+1) (PESOS COLOMBIANOS)"]
{"$rows_left_out":22}
{"sheet":"Formulario 8. Fuentes y usos ","index":11,"n_rows":66,"n_cols":24,"rows_kept":66,"cut":false,"hidden":false,"merged":[[57,5,57,12],[57,14,57,16],[15,5,15,12],[15,14,15,16],[53,0,53,4],[54,0,54,4],[6,0,6,3],[7,0,7,3],[15,0,16,3],[15,4,17,4],[57,0,58,3],[57,4,59,4]]}
[null,null,null,null,null,null,null,null,"MINISTERIO DE HACIENDA Y CRÉDITO PÚBLICO "]
[null,null,null,null,null,null,null,null,"DIRECCIÓN  GENERAL DEL PRESUPUESTO PÚBLICO NACIONAL "]
[null,null,null,null,null,null,null,null,"ANTEPROYECTO DE PRESUPUESTO EICE VIGENCIA FISCAL 2020"]
[]
[null,null,null,null,null,null,null,null,"FORMULARIO 8. FUENTES Y USOS DEL PRESUPUESTO"]
[null,null,null,null,null,null,null,null,"CIFRAS EN PESOS"]
["SECTOR "]
["EMPRESA ",null,null,null,null,null,null,"CÓDIGO EICE",{"$f":"IFERROR(VLOOKUP(E8,Empresas!C2:D34,2,FALSE),\"\")","v":""}]
[]
[]
[]
[]
[]
[]
[]
{"$rows_left_out":51}