{"text_format":"1","workbook":"xlsx","n_sheets":8,"sheets":["Formulario 1.1- Ingresos E.P","Formulario 1.1A - Cálculo I-E.P","Formulario 1.2 - Ingresos F.E ","Formulario 1.2A-Cálculo I-F.E","DESPLEGABLES","Formulario 2- Gasto","Formulario 3-Clas. Económica","Formulario 5- Deuda Pública"],"not_rendered":{"charts":0,"images":1,"macros":0,"external_links":0,"defined_names":37,"comments":7,"pivot_tables":0},"unopened":[],"bounds":{"document_bytes":16777216,"sheet_cells":100000,"rows_first":2000,"rows_last":500,"rows_between":2000,"halvings":0,"cell_chars":16384,"cell_head_chars":4096},"cells_cut":0,"cells_raw":0,"read":"whole","date_system":"1900"}

{"sheet":"Formulario 1.1- Ingresos E.P","index":0,"n_rows":118,"n_cols":9,"rows_kept":118,"cut":false,"hidden":false,"merged":[[109,0,109,5],[23,8,24,8],[0,0,0,8],[1,0,1,8],[2,0,2,8],[4,5,4,7],[5,5,5,7],[6,5,6,7],[23,5,24,5],[23,6,24,6],[23,7,24,7],[4,1,4,4],[5,1,5,4],[6,1,6,4],[23,0,23,4]]}
["MINISTERIO DE HACIENDA Y CRÉDITO PÚBLICO "]
["Dirección General del Presupuesto Público Nacional"]
["Formulario 1.1 Anteproyecto Ingresos - Establecimientos Públicos"]
[]
[null,"TIPO DE INGRESO REGISTRADO",null,null,null,"ESTABLECIMIENTOS PÚBLICOS"]
[null,"SECCIÓN"]
[null,"UNIDAD EJECUTORA",null,null,null,{"$f":"IFERROR(VLOOKUP(F6,DESPLEGABLES!A1:B191,2,FALSE),\"\")","v":""}]
[]
[null,null,null,null,null,"ANTEPROYECTO DE PRESUPUESTO DE INGRESO - VIGENCIA",{"$f":"+'Formulario 1.1A - Cálculo I-E.P'!C8","v":2023},null,"(diligenciar en pesos)"]
[]
[]
[]
[]
[]
[]
{"$rows_left_out":104}
{"sheet":"Formulario 1.1A - Cálculo I-E.P","index":1,"n_rows":185,"n_cols":15,"rows_kept":185,"cut":false,"hidden":false,"merged":[[9,1,12,1],[7,0,7,1],[0,0,0,15],[1,0,1,15],[2,0,2,15],[5,1,5,6],[4,1,4,6],[9,3,9,5],[9,6,9,8],[9,9,9,14],[9,0,12,0],[10,9,10,10],[10,11,10,12]]}
["MINISTERIO DE HACIENDA Y CRÉDITO PÚBLICO"]
["Dirección General del Presupuesto Público Nacional"]
["Formulario 1.1A Cálculo de ingresos corrientes por productos - Establecimientos Públicos"]
[]
["SECCIÓN"]
["UNIDAD EJECUTORA",{"$f":"IFERROR(VLOOKUP(B5,DESPLEGABLES!A2:B191,2,FALSE),\"\")","v":""}]
[null,null,null,null,null,null,null,null,null,null,"(diligenciar en pesos)"]
["CÁLCULO DE LOS INGRESOS CORRIENTES POR PRODUCTO - VIGENCIA ",null,2023]
[]
["Producto","Clasificación Central de Producto",null,"Vigencia anterior (t-1)",null,null,"Vigencia en curso (t)",null,null,"Próxima Vigencia (t+1)"]
[null,null,"Unidad de","Cantidades","Precio","Ingreso Año","Cantidades","Precio","Ingreso Año","Cantidades",null,"Precio Promedio Unidad",null,"Ingreso Año","Ingreso"]
[null,null,"medida","Año","Promedio",null,"Año","Promedio",null,"Factor de","Cantidad","Factor de","Precio",null,"(t+1)"]
[null,null,null,null,"Unidad",null,null,"Unidad",null,"Incremento","Año","Incremento","Unidad",null,"Base Cero"]
[1,2,3,4,5,"6=5X4",7,8,"9=7X8",10,"11=7X10",12,"13=8X12","14=11X13","15=8X11"]
["1.02. INGRESOS NO TRIBUTARIOS",null,null,null,null,{"$f":"F16+F29+F41+F49+F54+F179","v":0},null,null,{"$f":"I16+I29+I41+I49+I54+I179","v":0},null,null,null,null,{"$f":"N16+N29+N41+N49+N54+N179","v":0},{"$f":"O16+O29+O41+O49+O54+O179","v":0}]
{"$rows_left_out":171}
{"sheet":"Formulario 1.2 - Ingresos F.E ","index":2,"n_rows":125,"n_cols":9,"rows_kept":125,"cut":false,"hidden":false,"merged":[[116,0,116,5],[6,5,6,7],[4,1,4,4],[5,1,5,4],[6,1,6,4],[7,1,7,4],[26,0,26,4],[8,5,8,7],[0,1,0,8],[1,1,1,8],[2,1,2,8],[4,5,4,7],[5,5,5,7],[26,8,27,8],[10,2,10,5],[26,5,27,5],[26,6,27,6],[26,7,27,7]]}
[null,"MINISTERIO DE HACIENDA Y CRÉDITO PÚBLICO "]
[null,"Dirección General del Presupuesto Público Nacional"]
[null,"Formulario 1.2. Anteproyecto Ingresos - Fondos Especiales "]
[]
[null,"TIPO DE INGRESO REGISTRADO",null,null,null,"FONDOS ESPECIALES - CONTRIBUCCIONES PARAFISCALES DE LA NACIÓN"]
[null,"SECCIÓN"]
[null,"UNIDAD EJECUTORA",null,null,null,{"$f":"IFERROR(VLOOKUP(F6,DESPLEGABLES!A1:B191,2,FALSE),\"\")","v":""}]
[null," NOMBRE DEL FONDO ESPECIAL",null,null,null,null,"CÓDIGO SIIF",{"$f":"IFERROR(VLOOKUP(F8,DESPLEGABLES!D2:E65,2,FALSE),\"\")","v":""}]
[null,null,null,null,null,"(SI EL NOMBRE DEL FONDO ESPECIAL NO APARECE EN LA LISTA DESPLEGABLE POR FAVOR  REGÍSTRELO AQUÍ)"]
[]
[null,null,"ANTEPROYECTO DE PRESUPUESTO DE INGRESOS  - VIGENCIA",null,null,null,{"$f":"+'Formulario 1.1A - Cálculo I-E.P'!C8","v":2023},null,"(diligenciar en pesos)"]
[]
[]
[]
[]
{"$rows_left_out":111}
{"sheet":"Formulario 1.2A-Cálculo I-F.E","index":3,"n_rows":206,"n_cols":15,"rows_kept":206,"cut":false,"hidden":false,"merged":[[11,0,14,0],[11,1,14,1],[11,3,11,5],[11,6,11,8],[11,9,11,14],[12,9,12,10],[12,11,12,12],[9,0,9,1],[6,1,6,6],[0,0,0,15],[1,0,1,15],[2,0,2,15],[4,1,4,6],[5,1,5,6],[7,1,7,6]]}
["MINISTERIO DE HACIENDA Y CRÉDITO PÚBLICO"]
["Dirección General del Presupuesto Público Nacional"]
["Formulario 1.2A Cálculo de ingresos corrientes por productos - Fondos Especiales "]
[]
["SECCIÓN"]
["UNIDAD EJECUTORA",{"$f":"IFERROR(VLOOKUP(B5,DESPLEGABLES!A2:B190,2,FALSE),\"\")","v":""}]
[" NOMBRE DEL FONDO ESPECIAL"]
["CÓDIGO SIIF"]
[]
["CÁLCULO DE LOS INGRESOS CORRIENTES POR PRODUCTO - VIGENCIA ",null,{"$f":"+'Formulario 1.1A - Cálculo I-E.P'!C8","v":2023},null,null,null,null,null,"(diligenciar en pesos)"]
[]
["Producto","Clasificación Central de Producto",null,"Vigencia anterior (t-1)",null,null,"Vigencia en curso (t)",null,null,"Próxima Vigencia (t+1)"]
[null,null,"Unidad de","Cantidades","Precio","Ingreso Año","Cantidades","Precio","Ingreso Año","Cantidades",null,"Precio Promedio Unidad",null,"Ingreso Año","Ingreso"]
[null,null,"medida","Año","Promedio",null,"Año","Promedio",null,"Factor de","Cantidad","Factor de","Precio",null,"(t+1)"]
[null,null,null,null,"Unidad",null,null,"Unidad",null,"Incremento","Año","Incremento","Unidad",null,"Base Cero"]
{"$rows_left_out":192}
{"sheet":"DESPLEGABLES","index":4,"n_rows":190,"n_cols":37,"rows_kept":190,"cut":false,"hidden":true,"merged":[]}
["SECCIÓN ","UNIDAD EJECUTORA ",null,"FONDOS ESPECIALES ","COD",null,"IMPUESTOS INDIRECTOS -FE","CÓD ",null,"CONTRIBUCIONES SOCIALES- EP","CÓD",null,"CONTRIBUCIONES SOCIALES -FE","CÓD",null,"CONTRIBUCIONES DIVERSAS - FE","CÓD",null,"CONTRIBUCIONES DIVERSAS - ESTAPÚBLICO","CÓD",null,"TASAS Y DERECHOS ADMINISTRATIVOS - EP","CÓD",null,"DERECHOS ECONÓMICOS POR USO DE RECURSOS NATURALES- EP","CÓD",null,"DERECHOS ECONÓMICOS POR USO DE RECURSOS NATURALES- FE","CÓD",null,"TRANSFERENCIAS CORRIENTES- EP","CÓD",null,"TRANSFERENCIAS CORRIENTES- FE","CÓD",null,"CPC"]
["010101","SENADO DE LA REPÚBLICA",null,"CONTRIBUCIÓN ENTIDADES VIGILADAS CONTRALORÍA GENERAL NACIÓN",602,null,"Impuesto social a las armas y municiones",10,null,"Salud","01",null,"Salud","01",null,"Contribución - Comisión de Regulación de Comunicaciones (CRC)","01",null,"Contribución - Comisión de regulación de comunicaciones","01",null,"Expedición de visas","01",null,"Derecho económico por uso del subsuelo","01",null,"Autorización de uso de zonas de fondeo - DIMAR ","06",null,"Indemnizaciones relacionadas con seguros no de vida","01",null,"Indemnizaciones relacionadas con seguros no de vida","01",null,"Agricultura, silvicultura y productos de la pesca"]
["010102","CÁMARA DE REPRESENTANTES",null,"CONTRIBUCIÓN ENTIDADES VIGILADAS SUPERINTENDENCIA SUBSIDIO FAMILIAR",603,null,"Impuesto de remate y adjudicaciones",11,null,"Pensión","02",null,"Pensión","02",null,"Contribución - Comisión de Regulación de Energía y Gas (CREG)","02",null,"Contribución - Superintendencia de Sociedades","04",null,"Expedición de pasaportes","02",null,"Concesiones mineras","02",null,null,null,null,"Sentencias y conciliaciones","02",null,"Sentencias y conciliaciones","02",null,"Minerales; electricidad, gas y agua"]
["020101","PRESIDENCIA DE LA REPÚBLICA - GESTIÓN GENERAL",null,"FINANCIACIÓN SECTOR JUSTICIA",609,null,"Sobretasa nacional a la gasolina",12,null,"Contribuciones asignaciones de retiro militares y policía","03",null,null,null,null,"Contribución - Comisión de Regulación de Agua Potable y Saneamiento Básico (CRA)","03",null,"Contribución - Superintendencia de Vigilancia y Seguridad Privada","05",null,"Apostilla o legalización","03",null,"Contraprestaciones portuarias","03",null,null,null,null,"Devolución IVA - Instituciones de educación superior ","04",null,"Prescripción de depósitos judiciales","03",null,"Productos alimenticios, bebidas y tabaco; textiles, prendas de vestir y productos de cuero"]
["020900","AGENCIA PRESIDENCIAL DE COOPERACIÓN INTERNACIONAL DE COLOMBIA, APC - COLOMBIA ",null,"FONDO DE DEFENSA NACIONAL","6010",null,"Sobretasa al ACPM",13,null,null,null,null,null,null,null,"Contribución - Superintendencia del Subsidio Familiar","07",null,"Contribución - Superintendencia de sociedades","06",null,"Protocolización de escrituras públicas","04",null,"Concesiones parques naturales","05",null,null,null,null,"Transferencias de otras unidades de gobierno","05",null,"Devolución IVA - Instituciones de educación superior","04",null,"Otros bienes transportables, (excepto productos metálicos, maquinaria y equipo)"]
["021100","UNIDAD NACIONAL PARA LA GESTIÓN DEL RIESGO DE DESASTRES ",null,"FONDO ESTUPEFACIENTES - MINSALUD","6013",null,null,null,null,"CONTRIBUCIONES ASOCIADAS A NÓMINA - EP","CÓD",null,"CONTRIBUCIONES ASOCIADAS A NÓMINA -FE","CÓD",null,"Contribución - Fondo de Compensación Ambiental",13,null,"Contribución de vigilancia - Superintendencia de Industria y Comercio","08",null,"Expedición de certificaciones en el exterior","05",null,"Permiso por acceso a recursos genéticos","07",null,null,null,null,"Recursos por bienes mostrencos y vocaciones hereditarias","07",null,"Transferencias de otras unidades de gobierno","05",null,"Productos metálicos, maquinaria y equipo"]
["021200","AGENCIA PARA LA REINCORPORACIÓN Y LA NORMALIZACIÓN - ARN",null,"FONDOS INTERNOS MINISTERIO DEFENSA","6014",null,null,null,null,"ICBF","01",null,"Escuelas industriales e institutos técnicos","04",null,"Contribución - Fondo Apoyo Financiero Zonas No Interconectadas (FAZNI) ",14,null,"Contribución de seguimiento - Superintendencia de Industria y Comercio","09",null,"Certificación sobre la existencia legal de sociedades","06",null,null,null,null,null,null,null,"Compensación UPC – SSS","09",null,"Recursos de terceros en consignación ","06",null,"Construcción y servicios de la construcción"]
["021300","AGENCIA NACIONAL INMOBILIARIA VIRGILIO BARCO VARGAS",null,"FONDOS INTERNOS POLICÍA NACIONAL","6015",null,"IMPUESTOS INDIRECTOS -FE","CÓD ",null,"SENA","02",null,"Aportes de cesantías","05",null,"Contribución - Fondo Apoyo Financiero para la Energización de las Zonas Rurales Interconectadas (FAER)",15,null,"Contribución - Superintendencia Financiera de Colombia","10",null,"Reconocimiento y autenticación de firmas ante cónsules colombianos","07",null,null,null,null,null,null,null,"Mercancías Aprehendidas, Decomisadas o Abandonadas","11",null,"Recursos por procesos de extinción de dominio","08",null,"Servicios de venta y de distribución; alojamiento; servicios de suministro de comidas y bebidas; servicios de transporte; y servicios de distribución de electricidad, gas y agua"]
["021401","AGENCIA DE RENOVACIÓN DEL TERRITORIO ART - GESTIÓN GENERAL",null,"FONDO ROTATORIO DE MINAS Y ENERGÍA","6017",null,"Impuesto solidario por el COVID-19",13,null,"ESAP","03",null,null,null,null,"Contribución - Fondo de Energías No Convencionales y Gestión Eficiente de la Energía (FENOGE)",16,null,"Contribución - Superintendencia de Servicios Públicos Domiciliarios","11",null,"Expedición de tarjetas de registro consular","08",null,null,null,null,null,null,null,null,null,null,"Compensación UPC – SSS","09",null,"Servicios financieros y servicios conexos, servicios inmobiliarios y servicios de leasing"]
["021402","DIRECCIÓN DE SUSTITUCIÓN DE CULTIVOS DE USO ILÍCITO",null,"ESCUELAS INDUSTRIALES E INSTITUTOS TÉCNICOS","6019",null,null,null,null,null,null," ",null,null,null,"Contribución - Fondo Especial de Energía Social (FOES)",17,null,"Contribución - Superintendencia de Puertos y Transporte",12,null,"Trámite de nacionalidad colombiana por adopción","09",null,"CÁLCULO POR INGRESOS CORRIENTES",null,null,"TASAS Y DERECHOS ADMINISTRATIVOS - EP",null,null,"IMPUESTOS INDIRECTOS -FE",null,null,"Recursos FRISCO",10,null,"Servicios prestados a las empresas y servicios de producción"]
["030101","DEPARTAMENTO DE PLANEACIÓN - GESTIÓN GENERAL",null,"FONDO DE RECURSOS SOAT Y FONSAT (ANTES FOSYGA)","6021",null,null,null,null,"CONTRIBUCIONES ESPECIALES  - EP","CÓD",null,null,null,null,"Contribución - Fondo Especial Cuota de Fomento de Gas Natural",18,null,"Contribución pensionados militares y policía",23,null,"Trámite de renuncia a la nacionalidad colombiana","10",null,null,null,null,"1.02.2.01. Expedición de visas",null,null,"1.01.2.10. Impuesto social a las armas y municiones",null,null,"Prescripción especial adquisitivo de dominio",12,null,"Servicios para la comunidad, sociales y personales"]
["030300","UNIDAD ADMINISTRATIVA ESPECIAL - AGENCIA NACIONAL DE CONTRATACIÓN PÚBLICA - COLOMBIA COMPRA EFICIENTE",null,"FONDO DE SOLIDARIDAD PENSIONAL","6022",null,null,null,null,null,null,null,"CONTRIBUCIONES ESPECIALES -FE","CÓD",null,"Contribución - Fondo Especial para el programa de Normalización de Redes Eléctricas (Prone)",19,null,"Derecho económico por precios altos",33,null,"Expedición de certificados de antepasados de extranjeros nacionalizados como colombianos por adopción","11",null,"CONTRIBUCIONES SOCIALES- EP",null,null,"1.02.2.02. Expedición de pasaportes",null,null,"1.01.2.11. Impuesto de remate y adjudicaciones",null,null,"Recursos por acuerdos de compartición Ley 1743 de 2014",13]
["032400","SUPERINTENDENCIA DE SERVICIOS PÚBLICOS DOMICILIARIOS",null,"COMISIÓN DE REGULACIÓN DE ENERGÍA Y GAS","6024",null,"MULTAS Y SANCIONES","CÓD ",null,null,null,null,"Cuota de fiscalización y auditaje","01",null,"Contribución - Fondo de Solidaridad para Subsidios y Redistribución de Ingresos",20,null,"Derecho económico por participación en la producción",34,null,"Expedición de certificados de no objeción a la permanencia en el exterior de estudiantes colombianos","12",null,"1.02.1.01.01. Salud",null,null,"1.02.2.03. Apostilla o legalización",null,null,"1.01.2.12. Sobretasa nacional a la gasolina",null,null,"Del Fondo para la Modernización, Descongestión y Bienestar de la Administración de la Justicia ",14]
["040101","DEPARTAMENTO ADMINISTRATIVO NACIONAL DE ESTADÍSTICA (DANE) - GESTIÓN GENERAL",null,"COMISIÓN DE REGULACIÓN DE AGUA POTABLE","6025",null,"Multas Superintendencias","01",null,null,null,null,"Aporte a la administración de justicia","02",null,"Contribución - Fondo Emprender",21,null,"Contribución Nacional de Valorización",40,null,"Expedición de cédulas de ciudadanía","13",null,"1.02.1.01.02. Pensión",null,null,"1.02.2.04. Protocolización de escrituras públicas",null,null,"1.01.2.13. Sobretasa al ACPM",null,null,"Distribución Ley 55 de 1985 Superintendencia de Notariado y Registro ","15"]
["040200","FONDO ROTATORIO DEL DANE",null,"INSTITUTO DE ESTUDIOS DEL MINISTERIO PUBLICO","6031",null,"Sanciones aduaneras","02",null,"CESANTÍAS","CÓD",null,null,null,null,"Contribución - Fondo Nacional de las Universidades Estatales de Colombia",22,null,"Contribución SOAT",44,null,"Expedición de tarjetas de identidad","14",null,"1.02.1.01.03. Contribuciones asignaciones de retiro militares y policía",null,null,"1.02.2.05. Expedición de certificaciones en el exterior "]
{"$rows_left_out":176}
{"sheet":"Formulario 2- Gasto","index":5,"n_rows":522,"n_cols":15,"rows_kept":522,"cut":false,"hidden":false,"merged":[[12,14,14,14],[13,1,14,1],[13,2,14,2],[13,3,14,3],[516,4,518,4],[516,5,516,7],[12,0,12,3],[516,8,516,10],[516,11,516,13],[512,0,512,4],[513,0,513,4],[13,0,14,0],[0,3,0,13],[1,3,1,13],[2,3,2,13],[12,5,12,7],[12,8,12,10],[12,4,14,4],[4,4,4,6],[5,4,5,6],[7,1,7,5],[12,11,12,13],[5,0,5,3],[4,0,4,3]]}
[null,null,null,"MINISTERIO DE HACIENDA Y CRÉDITO PÚBLICO"]
[null,null,null,"Dirección General del Presupuesto Público Nacional"]
[null,null,null,"Formulario 2. Anteproyecto Presupuesto de Gastos"]
[]
["SECCIÓN"]
["UNIDAD EJECUTORA",null,null,null,{"$f":"IFERROR(VLOOKUP(E5,DESPLEGABLES!A1:B191,2,FALSE),\"\")","v":""}]
[]
[null,"ANTEPROYECTO DE PRESUPUESTO DE GASTOS  - VIGENCIA",null,null,null,null,{"$f":"+'Formulario 1.1A - Cálculo I-E.P'!C8","v":2023}]
[]
[]
[null,null,null,null,null,null,"(diligenciar en pesos)"]
[]
["Clasificación",null,null,null,"Concepto","Proyectado vigencia en curso (t)",null,null,"Gastos programados (t+1)",null,null,"Vigencias Futuras aprobadas",null,null,"Observaciones"]
["Cta","Subcta","Obj gasto","Ord",null,"Aportes de la Nación","Recursos Propios","Total","Aportes de la Nación","Recursos Propios","Total","Aportes de la Nación","Recursos Propios","Total"]
[null,null,null,null,null,1,2,"3= 1+2",4,5,"6= 4+5",7,8,"9= 7+8"]
{"$rows_left_out":508}
{"sheet":"Formulario 3-Clas. Económica","index":6,"n_rows":56,"n_cols":17,"rows_kept":56,"cut":false,"hidden":false,"merged":[[0,0,0,16],[1,0,1,16],[2,0,2,16],[14,16,15,16],[9,5,9,16],[10,2,10,4],[10,5,10,11],[10,12,10,14],[14,0,15,0],[14,1,15,1],[14,2,15,2],[14,3,15,3],[14,4,15,4],[14,5,15,5],[9,0,9,4],[4,3,4,14],[5,3,5,14],[7,2,7,10],[4,1,4,2],[5,1,5,2],[14,12,15,12],[16,16,17,16],[18,0,19,0],[18,1,19,1],[18,2,19,2],[18,3,19,3],[18,4,19,4],[18,6,19,6],[18,12,19,12],[18,14,19,14],[18,16,19,16],[16,6,17,6],[16,7,17,7],[16,8,17,8],[16,11,17,11],[16,12,17,12],[16,14,17,14],[16,0,17,0],[16,1,17,1],[16,2,17,2],[16,3,17,3],[16,4,17,4],[16,5,17,5],[16,9,17,9],[18,5,19,5],[22,16,23,16],[20,13,21,13],[20,16,21,16],[22,0,23,0],[22,1,23,1],[22,2,23,2],[22,3,23,3],[22,4,23,4],[22,5,23,5],[22,6,23,6],[22,7,23,7],[20,0,21,0],[20,1,21,1],[20,2,21,2],[20,3,21,3],[20,4,21,4],[20,6,21,6],[20,7,21,7],[20,5,21,5],[24,2,25,2],[24,3,25,3],[24,4,25,4],[24,5,25,5],[22,8,23,8],[22,9,23,9],[22,10,23,10],[22,11,23,11],[22,13,23,13],[24,10,25,10],[28,0,29,0],[28,1,29,1],[28,2,29,2],[28,3,29,3],[28,4,29,4],[28,5,29,5],[24,14,25,14],[24,16,25,16],[26,0,27,0],[26,1,27,1],[26,2,27,2],[26,3,27,3],[26,4,27,4],[26,5,27,5],[26,6,27,6],[26,7,27,7],[24,6,25,6],[24,7,25,7],[24,8,25,8],[24,9,25,9],[24,11,25,11],[24,12,25,12],[24,0,25,0],[24,1,25,1],[28,6,29,6],[28,7,29,7],[28,8,29,8],[28,11,29,11],[28,15,29,15],[28,16,29,16],[28,12,29,12],[26,8,27,8],[26,11,27,11],[26,13,27,13],[26,16,27,16],[26,10,27,10],[28,10,29,10],[32,16,33,16],[30,16,31,16],[32,0,33,0],[32,1,33,1],[32,2,33,2],[32,3,33,3],[32,4,33,4],[32,5,33,5],[32,6,33,6],[32,7,33,7],[32,8,33,8],[30,6,31,6],[30,7,31,7],[30,8,31,8],[30,9,31,9],[30,10,31,10],[30,11,31,11],[30,0,31,0],[30,1,31,1],[30,2,31,2],[30,3,31,3],[30,4,31,4],[30,5,31,5],[32,10,33,10],[18,8,19,8],[20,8,21,8],[14,9,15,9],[16,10,17,10],[14,6,15,6],[14,7,15,7],[14,8,15,8],[14,10,15,10],[14,11,15,11],[18,10,19,10],[20,10,21,10],[32,9,33,9],[28,9,29,9],[26,9,27,9],[20,9,21,9],[18,9,19,9],[30,12,31,12],[32,12,33,12],[32,13,33,13],[30,13,31,13],[28,13,29,13],[24,13,25,13],[20,11,21,11],[18,11,19,11],[20,12,21,12],[22,12,23,12],[26,12,27,12],[32,11,33,11],[32,14,33,14],[32,15,33,15],[30,15,31,15],[26,15,27,15],[18,13,19,13],[16,13,17,13],[14,13,15,13],[14,14,15,14],[20,14,21,14],[22,14,23,14],[24,15,25,15],[22,15,23,15],[20,15,21,15],[18,15,19,15],[16,15,17,15],[14,15,15,15],[26,14,27,14],[28,14,29,14],[30,14,31,14],[43,0,43,4],[43,5,43,16],[44,0,44,4],[44,5,44,16],[47,0,47,4],[46,5,46,16],[46,0,46,4],[48,5,48,16],[45,0,45,4],[45,5,45,16],[47,5,47,16],[52,5,52,16],[54,5,54,6],[50,5,50,6],[52,0,52,4],[53,5,53,16],[49,0,49,4],[49,5,49,16],[48,0,48,4],[55,5,55,16],[51,0,51,4],[50,0,50,4],[51,5,51,16]]}
["MINISTERIO DE HACIENDA Y CRÉDITO PÚBLICO "]
["Dirección General del Presupuesto Público Nacional"]
["Formulario 3. Clasificación económica de los gastos de funcionamiento"]
[]
[null,"SECCIÓN"]
[null,"UNIDAD EJECUTORA",null,{"$f":"IFERROR(VLOOKUP(D5,DESPLEGABLES!A1:B191,2,FALSE),\"\")","v":""}]
[]
[null,null,"ANTEPROYECTO CLASIFICACIÓN ECONÓMICA DE LOS GASTOS DE FUNCIONAMIENTO - VIGENCIA",null,null,null,null,null,null,null,null,{"$f":"+'Formulario 1.1A - Cálculo I-E.P'!C8","v":2023},null,"(diligenciar en pesos)"]
[]
["CLASIFICADOR PRESUPUESTAL",null,null,null,null,"CLASIFICADOR ECONÓMICO"]
[null,null,"FUENTE FINANCIACIÓN",null,null,"GASTOS",null,null,null,null,null,null,"ACTIVOS NO FINANCIEROS",null,null,"ACTIVOS FINANCIEROS"]
["A","B","C","D","E","F","G","H","I","J","K","L","M","N","O","P","Q"]
["COD","CONCEPTO","VALOR CLASIFICADOR        APORTES NACIÓN","VALOR CLASIFICADOR  RECURSOS PROPIOS","VALOR CLASIFICADOR POR OBJETO\nTOTAL","REMUNERACIÓN A LOS EMPLEADOS","COMPRA DE BIENES Y SERVICIOS","INTERESES","SUBSIDIOS","DONACIONES","PRESTACIONES SOCIALES","OTROS GASTOS","ACTIVOS FIJOS","EXISTENCIAS","OBJETOS DE VALOR\nY\nACTIVOS NO PRODUCIDOS","ADQUISICIÓN ACTIVOS FINANCIEROS","VALOR CLASIFICADOR ECONÓMICO\nTOTAL "]
["A","GASTOS DE FUNCIONAMIENTO",{"$f":"+C15+C17+C23+C25+C27+C29+C31+C33","v":0},{"$f":"+D15+D17+D23+D25+D27+D29+D31+D33","v":0},{"$f":"C14+D14","v":0},{"$f":"F15","v":0},{"$f":"G17+G21+G27","v":0},{"$f":"H33","v":0},{"$f":"I23","v":0},{"$f":"J23+J25","v":0},{"$f":"K23+K31","v":0},{"$f":"L15+L23+L25+L33","v":0},{"$f":"M17+M19+M25","v":0},{"$f":"N21+N23+N27","v":0},{"$f":"O17+O19+O25","v":0},{"$f":"P29","v":0},{"$f":"SUM(Q15:Q34)","v":0}]
[1,"          GASTOS DE PERSONAL",null,null,{"$f":"C15+D15","v":0},null,null,null,null,null,null,null,null,null,null,null,{"$f":"F15+L15","v":0}]
{"$rows_left_out":42}
{"sheet":"Formulario 5- Deuda Pública","index":7,"n_rows":12,"n_cols":13,"rows_kept":12,"cut":false,"hidden":false,"merged":[[9,8,11,8],[9,9,9,12],[10,9,11,9],[10,10,11,10],[10,11,11,11],[10,12,11,12],[0,0,0,12],[1,0,1,12],[2,0,2,12],[9,0,11,0],[9,1,11,1],[4,3,4,10],[5,3,5,10],[4,1,4,2],[5,1,5,2],[9,2,10,3],[9,4,9,7],[10,4,11,4],[7,2,7,7],[10,5,11,5],[10,6,11,6],[10,7,11,7]]}
["MINISTERIO DE HACIENDA Y CRÉDITO PÚBLICO "]
["Dirección General del Presupuesto Público Nacional"]
["Formulario 5. Pagos Programados de Deuda Pública"]
[]
[null,"SECCIÓN"]
[null,"UNIDAD EJECUTORA",null,{"$f":"IFERROR(VLOOKUP(D5,DESPLEGABLES!A1:B191,2,FALSE),\"\")","v":""}]
[]
[null,null,"ANTEPROYECTO DEUDA PÚBLICA - VIGENCIA",null,null,null,null,null,{"$f":"+'Formulario 1.1A - Cálculo I-E.P'!C8","v":2023},null,null,"(diligenciar en pesos)"]
[]
["Clase de Prestamista","Identificación Código del Empréstito","Saldo Emprestito Moneda Original",null,"Pagos Próxima Vigencia, (t+1), (Moneda Original)",null,null,null,"Tasa de cambio","Pagos Próxima Vigencia, (t+1), (Pesos Colombianos)"]
[null,null,null,null,"Principal","Intereses","Comisiones","Total Pagos",null,"Amortizaciones","Intereses","Comisiones","Total Pagos"]
[null,null,"Moneda","Valor"]